{"text_format":"1","workbook":"xlsx","n_sheets":4,"sheets":["list of orgs","instructions","summary","detail"],"not_rendered":{"charts":0,"images":3,"macros":1,"external_links":0,"defined_names":3,"comments":2,"pivot_tables":0},"unopened":[],"bounds":{"document_bytes":16777216,"sheet_cells":100000,"rows_first":2000,"rows_last":500,"rows_between":2000,"halvings":0,"cell_chars":16384,"cell_head_chars":4096},"cells_cut":0,"cells_raw":0,"read":"whole","date_system":"1900"}

{"sheet":"list of orgs","index":0,"n_rows":255,"n_cols":9,"rows_kept":255,"cut":false,"hidden":true,"merged":[]}
["organization codes",null,null,null,null,"send to:","cc:","Date Sent:","Date Returned:"]
["H",100001,"Office of the President"]
["H",100002,"Governing Board"]
["H",100003,"UNH Foundation"]
["H",100005,"Admin Staff Council"]
["H",100006,"Say Something Donations"]
["H",100010,"Prato Campus"]
["H",200001,"Office Provost/VP Academic Affairs",null,null,"Daniel May"]
["H",200002,"Associate Provost",null,null,"Daniel May"]
["H",200003,"Dean Graduate School",null,null,"Daniel May"]
["H",200004,"Summer Undergrad Research Fund",null,null,"Daniel May"]
["H",200005,"University Research Scholars",null,null,"Daniel May"]
["H",200006,"Provost Honors Program",null,null,"Daniel May"]
["H",200007,"Convocation",null,null,"Daniel May"]
["H",200008,"Commencement",null,null,"Daniel May"]
["H",200009,"Army ROTC",null,null,"Daniel May"]
["H",200010,"China Program",null,null,"Daniel May"]
["H",200011,"Riyadh 7 Saudi Program",null,null,"n/a"]
["H",200012,"Special Academic Programs",null,null,"n/a"]
["H",200013,"Library",null,null,"Daniel May"]
["H",200014,"Faculty Senate",null,null,"Daniel May"]
["H",200015,"Center for Family Business",null,null,"Daniel May"]
["H",200016,"Institutional Research",null,null,"Daniel May"]
["H",200017,"Academic Assessment",null,null,"Daniel May"]
["H",200019,"Office of Grants and Sponsored Prog",null,null,"Daniel May"]
["H",200020,"Provost Lecture Series",null,null,"n/a"]
["H",200021,"Bartels Fellowship Lecture Series",null,null,"n/a"]
["H",200022,"Bartels Public Service Fellowship",null,null,"n/a"]
[null,200023,"Commencement Ball"]
[null,200024,"Diversity Council"]
[null,200025,"Riyadh 8 Saudi Program"]
[null,200026,"HCLC Cohort Saudi Program"]
["H",200501,"Office of Information Technology",null,null,"Daniel May"]
["H",200502,"ERP System Implementation",null,null,"Daniel May"]
["H",200503,"Mailroom",null,null,"Ron Quagliani"]
["H",210001,"Office Dean of Arts and Sciences",null,null,"Daniel May","Lourdes Alvarez"]
["H",210002,"English",null,null,"Daniel May","Lourdes Alvarez"]
["H",210003,"Mathematics",null,null,"Daniel May","Lourdes Alvarez"]
["H",210004,"History & Global Studies",null,null,"Daniel May","Lourdes Alvarez"]
["H",210005,"Division of Performing Arts",null,null,"n/a"]
{"$rows_left_out":216}
{"sheet":"instructions","index":1,"n_rows":25,"n_cols":3,"rows_kept":25,"cut":false,"hidden":false,"merged":[[18,1,18,2],[0,0,0,2],[2,0,2,2],[3,0,3,3],[14,1,14,2],[15,1,15,2],[27,1,27,2],[28,1,28,2],[29,1,29,2],[30,1,30,2],[20,1,20,2],[21,1,21,2],[22,1,22,2],[24,1,24,2],[25,1,25,2],[26,1,26,2]]}
["Departmental Budget Development Template Instructions"]
[]
["UNH's Budget Committee has established a new process for the development of the University's FY15 budget.  The FY15 Department Budget Submission form has been created as the standard format required by the Budget Committee for University-wide department operating budget submissions.  This universal format is required for all operating budget submissions but additional information and/or backup will be accepted if necessary and in some cases will be requested by the Budget Committee.  All Financial Managers are expected to be prepared to discuss their submission with their Supervisor, their Vice President and/or the Budget Committee when requested to do so."]
["Please note, this form covers submission of operating expense budgets only, Personnel requests and Capital Funding will be handled separately."]
[]
[]
["Explanation of Summary worksheet columns:"]
[]
[null,"Budget Proposal - Flat","This column is intended to represent the line item proposal submitted by the department "]
[null,"Budget Proposal - 5%","This column is intended to represent the line item proposal submitted by the department with a 5% reduction in available funding"]
[null,"Budget Proposal +5%","This column is intended to represent the line item proposal submitted by the department with a 5% addition in available funding"]
[]
[]
["Detail Template Worksheet instructions:"]
[null,"At the top of the page you must enter your department in the field provided.  A list of departments is provided in drop-down list in this field."]
[null,"In the Account #/Account Name field, click the drop down arrow to select an expense account."]
[]
[]
[null,"Below the Account #/Account Name, enter the appropriate details for the selected expense account line.  Enter the description of the expense in column F and the amount in columns G, I and K as appropriate."]
[]
[null,"You are able to calculate three budget scenarios:  the first is a total department budget amount, the second is a department budget amount with a 5% reduction to the \"Flat\" Scenario and the third is a department budget amount equal with a 5% addition to to the \"Flat\" Scenario.  A column for each of these scenarios has been provided in the detail template form. "]
[null,"Please note, the reductions and additions can be taken on any account line as long as the total amount submitted for the scenario equals the appropriate allocation for that scenario."]
[]
[]
[null,"A subtotal will automatically be generated for each expense account selected on the detail template worksheet.  These subtotals will also automatically transfer to the Summary worksheet in this workbook.  You do not need to manually enter subtotals into the Summary worksheet."]

{"sheet":"summary","index":2,"n_rows":356,"n_cols":8,"rows_kept":356,"cut":false,"hidden":false,"merged":[[0,4,0,5],[0,6,0,7]]}
[null,"Budget Proposal",null,null,{"$f":"+IF(F2<>0,\"Proposal not equal to -5%\",\"\")","v":""},null,{"$f":"+IF(H2<>0,\"Proposal not equal to +5%\",\"\")","v":""}]
[null,null,null,{"$f":"+D192-detail!G166","v":0},null,{"$f":"+F192-detail!I166","v":0},null,{"$f":"+H192-detail!K166","v":0}]
[null,"Fiscal Year:",null,"DO NOT OVERRIDE FORMULAS - ALL DATA ENTRY IS DONE ON THE \"detail\" TAB"]
[null,"Department:","100001 - Office of the President"]
[null,null,null,"Flat",null,"-5% Scenario",null,"+5% Scenario"]
[null,null,null,"Budget Proposal",null,"Budget Proposal",null,"Budget Proposal"]
[null,"Account #","Account Name"]
["100001 - Office of the President",700000,"Operating Budget Pool",{"$f":"SUMIF(detail!$D$15:$D$193,(\"subtotal \"&B8&\" \"&C8),detail!$G$15:$G$193)","v":0},null,{"$f":"SUMIF(detail!$D$15:$D$193,(\"subtotal \"&B8&\" \"&C8),detail!$I$15:$I$193)","v":0},null,{"$f":"SUMIF(detail!$D$15:$D$193,(\"subtotal \"&B8&\" \"&C8),detail!$K$15:$K$193)","v":0}]
["100002 - Governing Board",711010,"Office Supplies",{"$f":"SUMIF(detail!$D$15:$D$193,(\"subtotal \"&B9&\" \"&C9),detail!$G$15:$G$193)","v":0},null,{"$f":"SUMIF(detail!$D$15:$D$193,(\"subtotal \"&B9&\" \"&C9),detail!$I$15:$I$193)","v":0},null,{"$f":"SUMIF(detail!$D$15:$D$193,(\"subtotal \"&B9&\" \"&C9),detail!$K$15:$K$193)","v":0}]
["100003 - UNH Foundation",711020,"Paper",{"$f":"SUMIF(detail!$D$15:$D$193,(\"subtotal \"&B10&\" \"&C10),detail!$G$15:$G$193)","v":0},null,{"$f":"SUMIF(detail!$D$15:$D$193,(\"subtotal \"&B10&\" \"&C10),detail!$I$15:$I$193)","v":0},null,{"$f":"SUMIF(detail!$D$15:$D$193,(\"subtotal \"&B10&\" \"&C10),detail!$K$15:$K$193)","v":0}]
["100005 - Admin Staff Council",711030,"Books",{"$f":"SUMIF(detail!$D$15:$D$193,(\"subtotal \"&B11&\" \"&C11),detail!$G$15:$G$193)","v":0},null,{"$f":"SUMIF(detail!$D$15:$D$193,(\"subtotal \"&B11&\" \"&C11),detail!$I$15:$I$193)","v":0},null,{"$f":"SUMIF(detail!$D$15:$D$193,(\"subtotal \"&B11&\" \"&C11),detail!$K$15:$K$193)","v":0}]
["100006 - Say Something Donations",711040,"Dues and Memberships",{"$f":"SUMIF(detail!$D$15:$D$193,(\"subtotal \"&B12&\" \"&C12),detail!$G$15:$G$193)","v":0},null,{"$f":"SUMIF(detail!$D$15:$D$193,(\"subtotal \"&B12&\" \"&C12),detail!$I$15:$I$193)","v":0},null,{"$f":"SUMIF(detail!$D$15:$D$193,(\"subtotal \"&B12&\" \"&C12),detail!$K$15:$K$193)","v":0}]
["100010 - Prato Campus",711050,"Subscriptions",{"$f":"SUMIF(detail!$D$15:$D$193,(\"subtotal \"&B13&\" \"&C13),detail!$G$15:$G$193)","v":0},null,{"$f":"SUMIF(detail!$D$15:$D$193,(\"subtotal \"&B13&\" \"&C13),detail!$I$15:$I$193)","v":0},null,{"$f":"SUMIF(detail!$D$15:$D$193,(\"subtotal \"&B13&\" \"&C13),detail!$K$15:$K$193)","v":0}]
["200001 - Office Provost/VP Academic Affairs",711060,"Professional Licenses",{"$f":"SUMIF(detail!$D$15:$D$193,(\"subtotal \"&B14&\" \"&C14),detail!$G$15:$G$193)","v":0},null,{"$f":"SUMIF(detail!$D$15:$D$193,(\"subtotal \"&B14&\" \"&C14),detail!$I$15:$I$193)","v":0},null,{"$f":"SUMIF(detail!$D$15:$D$193,(\"subtotal \"&B14&\" \"&C14),detail!$K$15:$K$193)","v":0}]
["200002 - Associate Provost",711070,"Minor Equipment - Non Capital",{"$f":"SUMIF(detail!$D$15:$D$193,(\"subtotal \"&B15&\" \"&C15),detail!$G$15:$G$193)","v":0},null,{"$f":"SUMIF(detail!$D$15:$D$193,(\"subtotal \"&B15&\" \"&C15),detail!$I$15:$I$193)","v":0},null,{"$f":"SUMIF(detail!$D$15:$D$193,(\"subtotal \"&B15&\" \"&C15),detail!$K$15:$K$193)","v":0}]
["200003 - Dean Graduate School",711080,"Medical Supplies",{"$f":"SUMIF(detail!$D$15:$D$193,(\"subtotal \"&B16&\" \"&C16),detail!$G$15:$G$193)","v":0},null,{"$f":"SUMIF(detail!$D$15:$D$193,(\"subtotal \"&B16&\" \"&C16),detail!$I$15:$I$193)","v":0},null,{"$f":"SUMIF(detail!$D$15:$D$193,(\"subtotal \"&B16&\" \"&C16),detail!$K$15:$K$193)","v":0}]
["200004 - Summer Undergrad Research Fund",711090,"Goodwill Supplies & Equipment",{"$f":"SUMIF(detail!$D$15:$D$193,(\"subtotal \"&B17&\" \"&C17),detail!$G$15:$G$193)","v":0},null,{"$f":"SUMIF(detail!$D$15:$D$193,(\"subtotal \"&B17&\" \"&C17),detail!$I$15:$I$193)","v":0},null,{"$f":"SUMIF(detail!$D$15:$D$193,(\"subtotal \"&B17&\" \"&C17),detail!$K$15:$K$193)","v":0}]
["200005 - University Research Scholars",712010,"Banking Fees",{"$f":"SUMIF(detail!$D$15:$D$193,(\"subtotal \"&B18&\" \"&C18),detail!$G$15:$G$193)","v":0},null,{"$f":"SUMIF(detail!$D$15:$D$193,(\"subtotal \"&B18&\" \"&C18),detail!$I$15:$I$193)","v":0},null,{"$f":"SUMIF(detail!$D$15:$D$193,(\"subtotal \"&B18&\" \"&C18),detail!$K$15:$K$193)","v":0}]
["200006 - Provost Honors Program",712020,"Credit Card Processing Fees",{"$f":"SUMIF(detail!$D$15:$D$193,(\"subtotal \"&B19&\" \"&C19),detail!$G$15:$G$193)","v":0},null,{"$f":"SUMIF(detail!$D$15:$D$193,(\"subtotal \"&B19&\" \"&C19),detail!$I$15:$I$193)","v":0},null,{"$f":"SUMIF(detail!$D$15:$D$193,(\"subtotal \"&B19&\" \"&C19),detail!$K$15:$K$193)","v":0}]
["200007 - Convocation",712030,"Miscellanous Taxes",{"$f":"SUMIF(detail!$D$15:$D$193,(\"subtotal \"&B20&\" \"&C20),detail!$G$15:$G$193)","v":0},null,{"$f":"SUMIF(detail!$D$15:$D$193,(\"subtotal \"&B20&\" \"&C20),detail!$I$15:$I$193)","v":0},null,{"$f":"SUMIF(detail!$D$15:$D$193,(\"subtotal \"&B20&\" \"&C20),detail!$K$15:$K$193)","v":0}]
["200008 - Commencement",712040,"Derivative Expenses",{"$f":"SUMIF(detail!$D$15:$D$193,(\"subtotal \"&B21&\" \"&C21),detail!$G$15:$G$193)","v":0},null,{"$f":"SUMIF(detail!$D$15:$D$193,(\"subtotal \"&B21&\" \"&C21),detail!$I$15:$I$193)","v":0},null,{"$f":"SUMIF(detail!$D$15:$D$193,(\"subtotal \"&B21&\" \"&C21),detail!$K$15:$K$193)","v":0}]
["200009 - Army ROTC",712050,"Interest Expenses",{"$f":"SUMIF(detail!$D$15:$D$193,(\"subtotal \"&B22&\" \"&C22),detail!$G$15:$G$193)","v":0},null,{"$f":"SUMIF(detail!$D$15:$D$193,(\"subtotal \"&B22&\" \"&C22),detail!$I$15:$I$193)","v":0},null,{"$f":"SUMIF(detail!$D$15:$D$193,(\"subtotal \"&B22&\" \"&C22),detail!$K$15:$K$193)","v":0}]
["200010 - China Program",712060,"Investment Expenses",{"$f":"SUMIF(detail!$D$15:$D$193,(\"subtotal \"&B23&\" \"&C23),detail!$G$15:$G$193)","v":0},null,{"$f":"SUMIF(detail!$D$15:$D$193,(\"subtotal \"&B23&\" \"&C23),detail!$I$15:$I$193)","v":0},null,{"$f":"SUMIF(detail!$D$15:$D$193,(\"subtotal \"&B23&\" \"&C23),detail!$K$15:$K$193)","v":0}]
["200012 - Special Academic Programs",712080,"Collection Fees",{"$f":"SUMIF(detail!$D$15:$D$193,(\"subtotal \"&B24&\" \"&C24),detail!$G$15:$G$193)","v":0},null,{"$f":"SUMIF(detail!$D$15:$D$193,(\"subtotal \"&B24&\" \"&C24),detail!$I$15:$I$193)","v":0},null,{"$f":"SUMIF(detail!$D$15:$D$193,(\"subtotal \"&B24&\" \"&C24),detail!$K$15:$K$193)","v":0}]
["200013 - Library",712090,"Custodial Fees",{"$f":"SUMIF(detail!$D$15:$D$193,(\"subtotal \"&B25&\" \"&C25),detail!$G$15:$G$193)","v":0},null,{"$f":"SUMIF(detail!$D$15:$D$193,(\"subtotal \"&B25&\" \"&C25),detail!$I$15:$I$193)","v":0},null,{"$f":"SUMIF(detail!$D$15:$D$193,(\"subtotal \"&B25&\" \"&C25),detail!$K$15:$K$193)","v":0}]
["200014 - Faculty Senate",712095,"Perkins Administrative Expenses",{"$f":"SUMIF(detail!$D$15:$D$193,(\"subtotal \"&B26&\" \"&C26),detail!$G$15:$G$193)","v":0},null,{"$f":"SUMIF(detail!$D$15:$D$193,(\"subtotal \"&B26&\" \"&C26),detail!$I$15:$I$193)","v":0},null,{"$f":"SUMIF(detail!$D$15:$D$193,(\"subtotal \"&B26&\" \"&C26),detail!$K$15:$K$193)","v":0}]
["210001 - Office Dean of Arts and Sciences",715010,"Educational Supplies",{"$f":"SUMIF(detail!$D$15:$D$193,(\"subtotal \"&B27&\" \"&C27),detail!$G$15:$G$193)","v":0},null,{"$f":"SUMIF(detail!$D$15:$D$193,(\"subtotal \"&B27&\" \"&C27),detail!$I$15:$I$193)","v":0},null,{"$f":"SUMIF(detail!$D$15:$D$193,(\"subtotal \"&B27&\" \"&C27),detail!$K$15:$K$193)","v":0}]
["210002 - English",715020,"Lab Supplies",{"$f":"SUMIF(detail!$D$15:$D$193,(\"subtotal \"&B28&\" \"&C28),detail!$G$15:$G$193)","v":0},null,{"$f":"SUMIF(detail!$D$15:$D$193,(\"subtotal \"&B28&\" \"&C28),detail!$I$15:$I$193)","v":0},null,{"$f":"SUMIF(detail!$D$15:$D$193,(\"subtotal \"&B28&\" \"&C28),detail!$K$15:$K$193)","v":0}]
["210003 - Mathematics",715030,"Accreditation",{"$f":"SUMIF(detail!$D$15:$D$193,(\"subtotal \"&B29&\" \"&C29),detail!$G$15:$G$193)","v":0},null,{"$f":"SUMIF(detail!$D$15:$D$193,(\"subtotal \"&B29&\" \"&C29),detail!$I$15:$I$193)","v":0},null,{"$f":"SUMIF(detail!$D$15:$D$193,(\"subtotal \"&B29&\" \"&C29),detail!$K$15:$K$193)","v":0}]
["210004 - History & Global Studies",715040,"Instructional Media",{"$f":"SUMIF(detail!$D$15:$D$193,(\"subtotal \"&B30&\" \"&C30),detail!$G$15:$G$193)","v":0},null,{"$f":"SUMIF(detail!$D$15:$D$193,(\"subtotal \"&B30&\" \"&C30),detail!$I$15:$I$193)","v":0},null,{"$f":"SUMIF(detail!$D$15:$D$193,(\"subtotal \"&B30&\" \"&C30),detail!$K$15:$K$193)","v":0}]
["210005 - Division of Performing Arts",715050,"Cleaning Supplies",{"$f":"SUMIF(detail!$D$15:$D$193,(\"subtotal \"&B31&\" \"&C31),detail!$G$15:$G$193)","v":0},null,{"$f":"SUMIF(detail!$D$15:$D$193,(\"subtotal \"&B31&\" \"&C31),detail!$I$15:$I$193)","v":0},null,{"$f":"SUMIF(detail!$D$15:$D$193,(\"subtotal \"&B31&\" \"&C31),detail!$K$15:$K$193)","v":0}]
["210006 - Philosophy & Modern Languages",715060,"Maintenance Parts and Supplies",{"$f":"SUMIF(detail!$D$15:$D$193,(\"subtotal \"&B32&\" \"&C32),detail!$G$15:$G$193)","v":0},null,{"$f":"SUMIF(detail!$D$15:$D$193,(\"subtotal \"&B32&\" \"&C32),detail!$I$15:$I$193)","v":0},null,{"$f":"SUMIF(detail!$D$15:$D$193,(\"subtotal \"&B32&\" \"&C32),detail!$K$15:$K$193)","v":0}]
["210007 - Political Science",716100,"Copier Leases",{"$f":"SUMIF(detail!$D$15:$D$193,(\"subtotal \"&B33&\" \"&C33),detail!$G$15:$G$193)","v":0},null,{"$f":"SUMIF(detail!$D$15:$D$193,(\"subtotal \"&B33&\" \"&C33),detail!$I$15:$I$193)","v":0},null,{"$f":"SUMIF(detail!$D$15:$D$193,(\"subtotal \"&B33&\" \"&C33),detail!$K$15:$K$193)","v":0}]
["210008 - Sociology",716101,"Facility Leases",{"$f":"SUMIF(detail!$D$15:$D$193,(\"subtotal \"&B34&\" \"&C34),detail!$G$15:$G$193)","v":0},null,{"$f":"SUMIF(detail!$D$15:$D$193,(\"subtotal \"&B34&\" \"&C34),detail!$I$15:$I$193)","v":0},null,{"$f":"SUMIF(detail!$D$15:$D$193,(\"subtotal \"&B34&\" \"&C34),detail!$K$15:$K$193)","v":0}]
["210009 - Psychology",716102,"Equipment Leases",{"$f":"SUMIF(detail!$D$15:$D$193,(\"subtotal \"&B35&\" \"&C35),detail!$G$15:$G$193)","v":0},null,{"$f":"SUMIF(detail!$D$15:$D$193,(\"subtotal \"&B35&\" \"&C35),detail!$I$15:$I$193)","v":0},null,{"$f":"SUMIF(detail!$D$15:$D$193,(\"subtotal \"&B35&\" \"&C35),detail!$K$15:$K$193)","v":0}]
["210010 - Music",716105,"Printing",{"$f":"SUMIF(detail!$D$15:$D$193,(\"subtotal \"&B36&\" \"&C36),detail!$G$15:$G$193)","v":0},null,{"$f":"SUMIF(detail!$D$15:$D$193,(\"subtotal \"&B36&\" \"&C36),detail!$I$15:$I$193)","v":0},null,{"$f":"SUMIF(detail!$D$15:$D$193,(\"subtotal \"&B36&\" \"&C36),detail!$K$15:$K$193)","v":0}]
["210011 - Music Lab",716110,"Postage",{"$f":"SUMIF(detail!$D$15:$D$193,(\"subtotal \"&B37&\" \"&C37),detail!$G$15:$G$193)","v":0},null,{"$f":"SUMIF(detail!$D$15:$D$193,(\"subtotal \"&B37&\" \"&C37),detail!$I$15:$I$193)","v":0},null,{"$f":"SUMIF(detail!$D$15:$D$193,(\"subtotal \"&B37&\" \"&C37),detail!$K$15:$K$193)","v":0}]
["210012 - Theatre",716111,"Freight & Courier",{"$f":"SUMIF(detail!$D$15:$D$193,(\"subtotal \"&B38&\" \"&C38),detail!$G$15:$G$193)","v":0},null,{"$f":"SUMIF(detail!$D$15:$D$193,(\"subtotal \"&B38&\" \"&C38),detail!$I$15:$I$193)","v":0},null,{"$f":"SUMIF(detail!$D$15:$D$193,(\"subtotal \"&B38&\" \"&C38),detail!$K$15:$K$193)","v":0}]
["210013 - Art & Design",716115,"Maintenance Agreements",{"$f":"SUMIF(detail!$D$15:$D$193,(\"subtotal \"&B39&\" \"&C39),detail!$G$15:$G$193)","v":0},null,{"$f":"SUMIF(detail!$D$15:$D$193,(\"subtotal \"&B39&\" \"&C39),detail!$I$15:$I$193)","v":0},null,{"$f":"SUMIF(detail!$D$15:$D$193,(\"subtotal \"&B39&\" \"&C39),detail!$K$15:$K$193)","v":0}]
["210014 - Art & Design Lab",716120,"In-House Duplicating Services",{"$f":"SUMIF(detail!$D$15:$D$193,(\"subtotal \"&B40&\" \"&C40),detail!$G$15:$G$193)","v":0},null,{"$f":"SUMIF(detail!$D$15:$D$193,(\"subtotal \"&B40&\" \"&C40),detail!$I$15:$I$193)","v":0},null,{"$f":"SUMIF(detail!$D$15:$D$193,(\"subtotal \"&B40&\" \"&C40),detail!$K$15:$K$193)","v":0}]
{"$rows_left_out":317}
{"sheet":"detail","index":3,"n_rows":166,"n_cols":12,"rows_kept":166,"cut":false,"hidden":false,"merged":[[7,7,7,8],[7,9,7,10],[102,2,102,4],[23,2,23,4],[30,2,30,4],[37,2,37,4],[44,2,44,4],[51,2,51,4],[58,2,58,4],[65,2,65,4],[74,2,74,4],[81,2,81,4],[88,2,88,4],[95,2,95,4],[16,2,16,4],[9,2,9,4],[7,5,7,6],[2,1,2,2],[151,2,151,4],[158,2,158,4],[109,2,109,4],[116,2,116,4],[123,2,123,4],[130,2,130,4],[137,2,137,4],[144,2,144,4],[6,2,6,3]]}
[null,null,null,null,null,"required field"]
[null,"Budget Proposal"]
[null,{"$f":"+\"Fiscal Year \"&summary!C3","v":"Fiscal Year "}]
[]
[null,"Department",{"$f":"summary!C4","v":"100001 - Office of the President"}]
[]
[null,"Index:"]
[null,null,null,null,null,"Flat",null,"-5% Scenario",null,"+5% Scenario"]
["700000 Operating Budget Pool",null,"Account # /Account Name",null,"Description of expenses","Flat Amount","Account Totals","-5% Amount","Account Totals","+5% Amount","Account Totals","Justification"]
["711010 Office Supplies"]
["711020 Paper"]
["711030 Books"]
["711040 Dues and Memberships"]
["711050 Subscriptions"]
["711060 Professional Licenses",null,null,{"$f":"+\"Subtotal \"&C10","v":"Subtotal "},null,null,{"$f":"+SUBTOTAL(9,F11:F14)","v":0},null,{"$f":"+SUBTOTAL(9,H11:H14)","v":0},null,{"$f":"+SUBTOTAL(9,J11:J14)","v":0}]
["711070 Minor Equipment - non-capital"]
["711080 Medical Supplies"]
["711090 Goodwill Supplies"]
["712030 Miscelleanous Taxes"]
["712050 Interest Expenses"]
["715010 Educational Supplies"]
["715020 Lab Supplies",null,null,{"$f":"+\"Subtotal \"&C17","v":"Subtotal "},null,null,{"$f":"+SUBTOTAL(9,F18:F21)","v":0},null,{"$f":"+SUBTOTAL(9,H18:H21)","v":0},null,{"$f":"+SUBTOTAL(9,J18:J21)","v":0}]
["715030 Accreditation"]
["715040 Instructional Media"]
["715050 Cleaning Supplies"]
["715060 Maintenance Parts and Supplies"]
["716100 Copier Leases"]
["716101 Facilities Rental"]
["716102 Equipment Rental",null,null,{"$f":"+\"Subtotal \"&C24","v":"Subtotal "},null,null,{"$f":"+SUBTOTAL(9,F25:F28)","v":0},null,{"$f":"+SUBTOTAL(9,H25:H28)","v":0},null,{"$f":"+SUBTOTAL(9,J25:J28)","v":0}]
["716105 Printing"]
["716110 Postage"]
["716111 Freight & Courier"]
["716115 Maintenance Agreements"]
["716120 In-House Duplicating Services"]
["716121 Outside Duplicating Services"]
["716125 Speakers and Entertainers",null,null,{"$f":"+\"Subtotal \"&C31","v":"Subtotal "},null,null,{"$f":"+SUBTOTAL(9,F32:F35)","v":0},null,{"$f":"+SUBTOTAL(9,H32:H35)","v":0},null,{"$f":"+SUBTOTAL(9,J32:J35)","v":0}]
["716130 Consulting"]
["716135 Temporary Staffing"]
["716140 Honoraria"]
["716145 Personal Service Agreements"]
{"$rows_left_out":126}